Target
C-C chemokine receptor type 5
Ligand
BDBM50143739
Substrate
Meas. Tech.
ChEMBL_39506 (CHEMBL654035)
IC50
80±n/a nM
Citation
 Thoma, GNuninger, FSchaefer, MAkyel, KGAlbert, RBeerli, CBruns, CFrancotte, ELuyten, MMacKenzie, DOberer, LStreiff, MBWagner, TWalter, HWeckbecker, GZerwes, HG Orally bioavailable competitive CCR5 antagonists. J Med Chem 47:1939-55 (2004)  
Target
Name:
C-C chemokine receptor type 5
Synonyms:
C-C CKR-5 CC-CKR-5 CCR5 CCR5_HUMAN CHEMR13 HIV-1 fusion coreceptor
Type:
Enzyme
Mol. Mass.:
40540.21
Organism:
Homo sapiens (Human)
Description:
P51681
Residue:
352
  
Inhibitor
Name:
BDBM50143739
Synonyms:
2-({[1'-(2,4-Dimethyl-1-oxy-pyridine-3-carbonyl)-4'-methyl-[1,4']bipiperidinyl-4-yl]-phenyl-amino}-methyl)-benzonitrile | CHEMBL418120
Type:
Small organic molecule
Emp. Form.:
C33H39N5O2
Mol. Mass.:
537.6951
SMILES:
Cc1cc[n+]([O-])c(C)c1C(=O)N1CCC(C)(CC1)N1CCC(CC1)N(Cc1ccccc1C#N)c1ccccc1
: