Target
Retinoic acid receptor RXR-alpha
Ligand
BDBM50143832
Substrate
Meas. Tech.
ChEMBL_196486 (CHEMBL798300)
Ki
40±n/a nM
Citation
 Haffner, CDLenhard, JMMiller, ABMcDougald, DLDwornik, KIttoop, ORGampe, RTXu, HEBlanchard, SMontana, VGConsler, TGBledsoe, RKAyscue, ACroom, D Structure-based design of potent retinoid X receptor alpha agonists. J Med Chem 47:2010-29 (2004)  
Target
Name:
Retinoic acid receptor RXR-alpha
Synonyms:
NR2B1 Nuclear receptor subfamily 4 group A member 2 RXRA Retinoic acid receptor RXR-alpha/gamma Retinoid receptor
Type:
PROTEIN
Mol. Mass.:
50820.38
Organism:
Homo sapiens (Human)
Description:
ChEMBL_1456363
Residue:
462
  
Inhibitor
Name:
BDBM50143832
Synonyms:
(E)-3-[4-(3,5,5,8,8-Pentamethyl-5,6,7,8-tetrahydro-naphthalen-2-yl)-4,5,6,7-tetrahydro-benzofuran-2-yl]-acrylic acid | CHEMBL432140
Type:
Small organic molecule
Emp. Form.:
C26H32O3
Mol. Mass.:
392.5305
SMILES:
Cc1cc2c(cc1C1CCCc3oc(\C=C\C(O)=O)cc13)C(C)(C)CCC2(C)C
: