Target
Retinoic acid receptor alpha
Ligand
BDBM50143835
Substrate
Meas. Tech.
ChEMBL_197389 (CHEMBL799708)
EC50
57±n/a nM
Citation
 Haffner, CDLenhard, JMMiller, ABMcDougald, DLDwornik, KIttoop, ORGampe, RTXu, HEBlanchard, SMontana, VGConsler, TGBledsoe, RKAyscue, ACroom, D Structure-based design of potent retinoid X receptor alpha agonists. J Med Chem 47:2010-29 (2004)  
Target
Name:
Retinoic acid receptor alpha
Synonyms:
NR1B1 RAR-alpha RARA_HUMAN Retinoic acid receptor alpha/Retinoid X receptor alpha Retinoid receptor
Type:
PROTEIN
Mol. Mass.:
50778.87
Organism:
Homo sapiens (Human)
Description:
ChEMBL_1466191
Residue:
462
  
Inhibitor
Name:
BDBM50143835
Synonyms:
(E)-3-[4-(5,5,8,8-Tetramethyl-5,6,7,8-tetrahydro-naphthalen-2-ylmethyl)-furan-2-yl]-acrylic acid | CHEMBL63048
Type:
Small organic molecule
Emp. Form.:
C22H26O3
Mol. Mass.:
338.44
SMILES:
CC1(C)CCC(C)(C)c2cc(Cc3coc(\C=C\C(O)=O)c3)ccc12
: