Target
Integrin alpha-IIb/beta-3
Ligand
BDBM50143852
Substrate
Meas. Tech.
ChEMBL_70162 (CHEMBL683382)
IC50
17±n/a nM
Citation
 Mehrotra, MMHeath, JASmyth, MSPandey, ARose, JWSeroogy, JMVolkots, DLNannizzi-Alaimo, LPark, GLLambing, JLHollenbach, SJScarborough, RM Discovery of novel 2,8-diazaspiro[4.5]decanes as orally active glycoprotein IIb-IIIa antagonists. J Med Chem 47:2037-61 (2004)  
Target
Name:
Integrin alpha-IIb/beta-3
Synonyms:
Glycoprotein IIb/IIIa
Type:
Mol. Mass.:
Description:
ASSAY_ID of EBI is 30109
Components:
This complex has 2 components.
Component 1
Name:
Integrin beta-3
Synonyms:
CD_antigen=CD61 GPIIIa ITGB3 Platelet membrane glycoprotein IIIa
Type:
Protein
Mol. Mass.:
87038.91
Organism:
Homo sapiens (Human)
Description:
P05106
Residue:
788
  
Component 2
Name:
Integrin alpha-IIb
Synonyms:
CD_antigen=CD41 GPIIb Glycoprotein IIb ITGA2B Integrin alpha-IIb heavy chain Integrin alpha-IIb light chain, form 2 Integrin alpha-V/beta-3 and alpha-IIb/beta 3 | Platelet membrane glycoprotein IIb
Type:
Protein
Mol. Mass.:
113354.85
Organism:
Homo sapiens (Human)
Description:
P08514
Residue:
1039
  
Inhibitor
Name:
BDBM50143852
Synonyms:
CHEMBL65525 | {2-[2-(4-Carbamimidoyl-phenyl)-1-oxo-2,8-diaza-spiro[4.5]dec-8-yl]-2-oxo-ethoxy}-acetic acid
Type:
Small organic molecule
Emp. Form.:
C19H24N4O5
Mol. Mass.:
388.4177
SMILES:
NC(=N)c1ccc(cc1)N1CCC2(CCN(CC2)C(=O)COCC(O)=O)C1=O
: