Target
Bifunctional epoxide hydrolase 2
Ligand
BDBM50143930
Substrate
Meas. Tech.
ChEMBL_67377 (CHEMBL677487)
IC50
33000±n/a nM
Citation
 Kim, IHMorisseau, CWatanabe, THammock, BD Design, synthesis, and biological activity of 1,3-disubstituted ureas as potent inhibitors of the soluble epoxide hydrolase of increased water solubility. J Med Chem 47:2110-22 (2004)  
Target
Name:
Bifunctional epoxide hydrolase 2
Synonyms:
Eph2 Epoxide hydratase Soluble epoxide hydrolase (sEH)
Type:
Enzyme
Mol. Mass.:
62512.06
Organism:
Mus musculus (Mouse)
Description:
P34914
Residue:
554
  
Inhibitor
Name:
BDBM50143930
Synonyms:
(3-Cyclohexyl-ureido)-acetic acid methyl ester methyl 2-(3-cyclohexylureido)acetate
Type:
Small organic molecule
Emp. Form.:
C10H18N2O3
Mol. Mass.:
214.2615
SMILES:
COC(=O)CNC(=O)NC1CCCCC1
: