Target
Cytochrome P450 2D6
Ligand
BDBM50143958
Substrate
Meas. Tech.
ChEBML_51740
Ki
1000±n/a nM
Citation
 Ashwell, MALapierre, JMKaplan, ALi, JMarr, CYuan, J The design, preparation and SAR of novel small molecule sodium (Na(+)) channel blockers. Bioorg Med Chem Lett 14:2025-30 (2004)  
Target
Name:
Cytochrome P450 2D6
Synonyms:
CP2D6_HUMAN CYP2DL1 Cytochrome P450 2D6 (CYP2D6) P450-DB1
Type:
Protein
Mol. Mass.:
55774.82
Organism:
Homo sapiens (Human)
Description:
P10635
Residue:
497
  
Inhibitor
Name:
BDBM50143958
Synonyms:
CHEMBL63060 | N-(4-Fluoro-phenyl)-N-{1-[2-hydroxy-3-(4-methoxy-phenoxy)-propyl]-piperidin-4-yl}-benzamide
Type:
Small organic molecule
Emp. Form.:
C28H31FN2O4
Mol. Mass.:
478.5551
SMILES:
COc1ccc(OCC(O)CN2CCC(CC2)N(C(=O)c2ccccc2)c2ccc(F)cc2)cc1
: