Target
Glucagon receptor
Ligand
BDBM50144005
Substrate
Meas. Tech.
ChEBML_72991
Ki
29±n/a nM
Citation
 Kurukulasuriya, RSorensen, BKLink, JTPatel, JRJae, HSWinn, MXRohde, JRGrihalde, NDLin, CWOgiela, CAAdler, ALCollins, CA Biaryl amide glucagon receptor antagonists. Bioorg Med Chem Lett 14:2047-50 (2004)  
Target
Name:
Glucagon receptor
Synonyms:
GCGR GLR_HUMAN Glucagon receptor (GlucR)
Type:
Enzyme
Mol. Mass.:
54026.92
Organism:
Homo sapiens (Human)
Description:
P47871
Residue:
477
  
Inhibitor
Name:
BDBM50144005
Synonyms:
3-{4-[2-(4-tert-Butyl-phenyl)-2-(4-hydroxymethyl-phenylcarbamoyl)-ethyl]-benzoylamino}-propionic acid | CHEMBL64955
Type:
Small organic molecule
Emp. Form.:
C30H34N2O5
Mol. Mass.:
502.6014
SMILES:
CC(C)(C)c1ccc(cc1)C(Cc1ccc(cc1)C(=O)NCCC(O)=O)C(=O)Nc1ccc(CO)cc1
: