Target
Adenylate cyclase type 1/2/3/4/5/6/7/8/9
Ligand
BDBM50144010
Substrate
Meas. Tech.
ChEMBL_31423 (CHEMBL645297)
Ki
>2000±n/a nM
Citation
 Kurukulasuriya, RSorensen, BKLink, JTPatel, JRJae, HSWinn, MXRohde, JRGrihalde, NDLin, CWOgiela, CAAdler, ALCollins, CA Biaryl amide glucagon receptor antagonists. Bioorg Med Chem Lett 14:2047-50 (2004)  
Target
Name:
Adenylate cyclase type 1/2/3/4/5/6/7/8/9
Synonyms:
Adenylate cyclase
Type:
Mol. Mass.:
Description:
ASSAY_ID of ChEMBL is 31423
Components:
This complex has 9 components.
Component 1
Name:
Adenylate cyclase type 3
Synonyms:
4.6.1.1 AC3 ADCY3_HUMAN Adenylate cyclase type 3 Adenylate cyclase, olfactive type KIAA0511
Type:
PROTEIN
Mol. Mass.:
128959.09
Organism:
Homo sapiens (Human)
Description:
ChEMBL_104878
Residue:
1144
  
Component 2
Name:
Adenylate cyclase type 6
Synonyms:
4.6.1.1 ADCY6_HUMAN Adenylate cyclase type 6 Adenylyl cyclase 6 KIAA0422
Type:
PROTEIN
Mol. Mass.:
130641.19
Organism:
Homo sapiens (Human)
Description:
ChEMBL_104878
Residue:
1168
  
Component 3
Name:
Adenylate cyclase type 1
Synonyms:
ADCY1 Adenylate cyclase | Brain adenylate cyclase 1
Type:
PROTEIN
Mol. Mass.:
123469.95
Organism:
Homo sapiens (Human)
Description:
ChEMBL_31877
Residue:
1119
  
Component 4
Name:
Adenylate cyclase type 2
Synonyms:
4.6.1.1 ADCY2_HUMAN Adenylate cyclase type 2 Adenylyl cyclase 2 | KIAA1060
Type:
PROTEIN
Mol. Mass.:
123627.70
Organism:
Homo sapiens (Human)
Description:
ChEMBL_104878
Residue:
1091
  
Component 5
Name:
Adenylate cyclase type 9
Synonyms:
AC9 ADCY9 ATP pyrophosphate-lyase 9 Adenylyl cyclase 9 | KIAA0520
Type:
Enzyme Catalytic Domain
Mol. Mass.:
150716.21
Organism:
Homo sapiens (Human)
Description:
O60503
Residue:
1353
  
Component 6
Name:
Adenylate cyclase type 7
Synonyms:
4.6.1.1 ADCY7_HUMAN Adenylate cyclase type 7 Adenylyl cyclase 7 | KIAA0037
Type:
PROTEIN
Mol. Mass.:
120335.78
Organism:
Homo sapiens (Human)
Description:
ChEMBL_104878
Residue:
1080
  
Component 7
Name:
Adenylate cyclase type 8
Synonyms:
4.6.1.1 ADCY8 ATP pyrophosphate-lyase 8 Adenylate cyclase type VIII Ca(2+)/calmodulin-activated adenylyl cyclase
Type:
PROTEIN
Mol. Mass.:
140131.08
Organism:
Homo sapiens (Human)
Description:
ChEMBL_104878
Residue:
1251
  
Component 8
Name:
Adenylate cyclase type 5
Synonyms:
ADCY5 Adenylate cyclase | Adenylate cyclase type V
Type:
PROTEIN
Mol. Mass.:
138919.21
Organism:
Homo sapiens (Human)
Description:
ChEMBL_31732
Residue:
1261
  
Component 9
Name:
Adenylate cyclase type 4
Synonyms:
4.6.1.1 ADCY4_HUMAN Adenylate cyclase type 4 Adenylyl cyclase 4
Type:
PROTEIN
Mol. Mass.:
119807.04
Organism:
Homo sapiens (Human)
Description:
ChEMBL_104878
Residue:
1077
  
Inhibitor
Name:
BDBM50144010
Synonyms:
3-{4-[(Biphenyl-4-ylcarbamoyl)-(4-tert-butyl-phenyl)-methoxy]-benzoylamino}-2-hydroxy-propionic acid | CHEMBL62432
Type:
Small organic molecule
Emp. Form.:
C34H34N2O6
Mol. Mass.:
566.6436
SMILES:
CC(C)(C)c1ccc(cc1)C(Oc1ccc(cc1)C(=O)NCC(O)C(O)=O)C(=O)Nc1ccc(cc1)-c1ccccc1
: