Target
Prothrombin
Ligand
BDBM50144124
Substrate
Meas. Tech.
ChEBML_209072
IC50
>10±n/a nM
Citation
 Jia, ZJSu, TZuckett, JFWu, YGoldman, EALi, WZhang, PClizbe, LASong, YBauer, SMHuang, WWoolfrey, JSinha, UArfsten, AEHutchaleelaha, AHollenbach, SJLambing, JLScarborough, RMZhu, BY N,N-Dialkylated 4-(4-arylsulfonylpiperazine-1-carbonyl)-benzamidines and 4-((4-arylsulfonyl)-2-oxo-piperazin-1-ylmethyl)-benzamidines as potent factor Xa inhibitors. Bioorg Med Chem Lett 14:2073-8 (2004)  
Target
Name:
Prothrombin
Synonyms:
Activation peptide fragment 1 Coagulation factor II Prothrombin precursor Thrombin heavy chain | Thrombin light chain
Type:
Protein
Mol. Mass.:
70029.57
Organism:
Homo sapiens (Human)
Description:
P00734
Residue:
622
  
Inhibitor
Name:
BDBM50144124
Synonyms:
CHEMBL293462 | [4-(6-Chloro-benzo[b]thiophene-2-sulfonyl)-piperazin-1-yl]-[4-(1-methyl-4,5-dihydro-1H-imidazol-2-yl)-phenyl]-methanone
Type:
Small organic molecule
Emp. Form.:
C23H23ClN4O3S2
Mol. Mass.:
503.037
SMILES:
CN1CCN=C1c1ccc(cc1)C(=O)N1CCN(CC1)S(=O)(=O)c1cc2ccc(Cl)cc2s1
: