Target
Vitamin K-dependent protein C
Ligand
BDBM50144092
Substrate
Meas. Tech.
ChEBML_27865
IC50
>10000±n/a nM
Citation
 Jia, ZJSu, TZuckett, JFWu, YGoldman, EALi, WZhang, PClizbe, LASong, YBauer, SMHuang, WWoolfrey, JSinha, UArfsten, AEHutchaleelaha, AHollenbach, SJLambing, JLScarborough, RMZhu, BY N,N-Dialkylated 4-(4-arylsulfonylpiperazine-1-carbonyl)-benzamidines and 4-((4-arylsulfonyl)-2-oxo-piperazin-1-ylmethyl)-benzamidines as potent factor Xa inhibitors. Bioorg Med Chem Lett 14:2073-8 (2004)  
Target
Name:
Vitamin K-dependent protein C
Synonyms:
Activated protein C cofactor Apolipoprotein H Blood coagulation factor XIV Coagulation factor V heavy chain Endothelial protein C receptor PROC_HUMAN Vitamin K-dependent protein C precursor
Type:
Enzyme
Mol. Mass.:
52067.73
Organism:
Homo sapiens (Human)
Description:
Residue:
461
  
Inhibitor
Name:
BDBM50144092
Synonyms:
CHEMBL294121 | [4-(5-Chloro-1H-indole-2-sulfonyl)-piperazin-1-yl]-[4-(1-methyl-4,5-dihydro-1H-imidazol-2-yl)-phenyl]-methanone
Type:
Small organic molecule
Emp. Form.:
C23H24ClN5O3S
Mol. Mass.:
485.986
SMILES:
CN1CCN=C1c1ccc(cc1)C(=O)N1CCN(CC1)S(=O)(=O)c1cc2cc(Cl)ccc2[nH]1
: