Target
Coagulation factor X
Ligand
BDBM50144140
Substrate
Meas. Tech.
ChEBML_48628
IC50
57±n/a nM
Citation
 Jia, ZJSu, TZuckett, JFWu, YGoldman, EALi, WZhang, PClizbe, LASong, YBauer, SMHuang, WWoolfrey, JSinha, UArfsten, AEHutchaleelaha, AHollenbach, SJLambing, JLScarborough, RMZhu, BY N,N-Dialkylated 4-(4-arylsulfonylpiperazine-1-carbonyl)-benzamidines and 4-((4-arylsulfonyl)-2-oxo-piperazin-1-ylmethyl)-benzamidines as potent factor Xa inhibitors. Bioorg Med Chem Lett 14:2073-8 (2004)  
Target
Name:
Coagulation factor X
Synonyms:
Activated coagulation factor X (FXa) Coagulation factor X precursor F10 Factor X heavy chain Factor Xa Stuart-Prower factor
Type:
Enzyme
Mol. Mass.:
54726.60
Organism:
Homo sapiens (Human)
Description:
Residue:
488
  
Inhibitor
Name:
BDBM50144140
Synonyms:
4-(5-Chloro-1H-indole-2-sulfonyl)-1-[4-(1-methyl-4,5-dihydro-1H-imidazol-2-yl)-benzyl]-piperazin-2-one | CHEMBL294782
Type:
Small organic molecule
Emp. Form.:
C23H24ClN5O3S
Mol. Mass.:
485.986
SMILES:
CN1CCN=C1c1ccc(CN2CCN(CC2=O)S(=O)(=O)c2cc3cc(Cl)ccc3[nH]2)cc1
: