Target
cGMP-specific 3',5'-cyclic phosphodiesterase
Ligand
BDBM50144220
Substrate
Meas. Tech.
ChEBML_155363
IC50
0.580000±n/a nM
Citation
 Kim, DKYoung Lee, JPark, HJMinh Thai, K Synthesis and phosphodiesterase 5 inhibitory activity of new sildenafil analogues containing a phosphonate group in the 5(')-sulfonamide moiety of phenyl ring. Bioorg Med Chem Lett 14:2099-103 (2004)  
Target
Name:
cGMP-specific 3',5'-cyclic phosphodiesterase
Synonyms:
3',5'-cyclic phosphodiesterase PDE5 PDE5A_HUMAN Phosphodiesterase 5 (PDE5) Phosphodiesterase 5A (PDE5A) cGMP-specific 3',5'-cyclic phosphodiesterase
Type:
Protein
Mol. Mass.:
99975.83
Organism:
Homo sapiens (Human)
Description:
O76074
Residue:
875
  
Inhibitor
Name:
BDBM50144220
Synonyms:
CHEMBL63686 {4-[3-(1-Methyl-7-oxo-3-propyl-6,7-dihydro-1H-pyrazolo[4,3-d]pyrimidin-5-yl)-4-propoxy-benzenesulfonyl]-piperazin-1-ylmethyl}-phosphonic acid diethyl ester
Type:
Small organic molecule
Emp. Form.:
C27H41N6O7PS
Mol. Mass.:
624.689
SMILES:
CCCOc1ccc(cc1-c1nc2c(CCC)nn(C)c2c(=O)[nH]1)S(=O)(=O)N1CCN(CP(=O)(OCC)OCC)CC1
: