Target
P04972/P11541/P16586/P22571/P23439/Q95142
Ligand
BDBM50241303
Substrate
Meas. Tech.
ChEMBL_155382 (CHEMBL760835)
IC50
2.6±n/a nM
Citation
 Kim, DKYoung Lee, JPark, HJMinh Thai, K Synthesis and phosphodiesterase 5 inhibitory activity of new sildenafil analogues containing a phosphonate group in the 5(')-sulfonamide moiety of phenyl ring. Bioorg Med Chem Lett 14:2099-103 (2004)  
Target
Name:
P04972/P11541/P16586/P22571/P23439/Q95142
Synonyms:
Phosphodiesterase 6
Type:
Mol. Mass.:
Description:
ASSAY_ID of ChEMBL is 155381
Components:
This complex has 6 components.
Component 1
Name:
Retinal rod rhodopsin-sensitive cGMP 3',5'-cyclic phosphodiesterase subunit gamma
Synonyms:
CNRG_BOVIN PDE6G | PDEG
Type:
PROTEIN
Mol. Mass.:
9674.16
Organism:
Bos taurus
Description:
ChEMBL_104859
Residue:
87
  
Component 2
Name:
Cone cGMP-specific 3',5'-cyclic phosphodiesterase subunit alpha'
Synonyms:
PDE V-C1 PDE6C_BOVIN cGMP phosphodiesterase 6C
Type:
PROTEIN
Mol. Mass.:
98783.85
Organism:
Bos taurus
Description:
ChEMBL_104859
Residue:
855
  
Component 3
Name:
Rod cGMP-specific 3',5'-cyclic phosphodiesterase subunit alpha
Synonyms:
PDE6A PDEA Phosphodiesterase 6A
Type:
Enzyme
Mol. Mass.:
99320.22
Organism:
Bos taurus (Bovine)
Description:
P11541
Residue:
859
  
Component 4
Name:
Retinal cone rhodopsin-sensitive cGMP 3',5'-cyclic phosphodiesterase subunit gamma
Synonyms:
CNCG_BOVIN PDE6H
Type:
PROTEIN
Mol. Mass.:
9106.39
Organism:
Bos taurus
Description:
ChEMBL_104859
Residue:
83
  
Component 5
Name:
Retinal rod rhodopsin-sensitive cGMP 3',5'-cyclic phosphodiesterase subunit delta
Synonyms:
GMP-PDE delta PDE6D_BOVIN
Type:
PROTEIN
Mol. Mass.:
17388.28
Organism:
Bos taurus
Description:
ChEMBL_104859
Residue:
150
  
Component 6
Name:
Rod cGMP-specific 3',5'-cyclic phosphodiesterase subunit beta
Synonyms:
GMP-PDE beta PDE6B_BOVIN | PDEB
Type:
PROTEIN
Mol. Mass.:
98307.54
Organism:
Bos taurus
Description:
ChEMBL_104859
Residue:
853
  
Inhibitor
Name:
BDBM50241303
Synonyms:
CHEMBL245317 {1-[3-(1-Methyl-7-oxo-3-propyl-6,7-dihydro-1H-pyrazolo[4,3-d]pyrimidin-5-yl)-4-propoxy-benzenesulfonyl]-piperidin-4-ylmethyl}-phosphonic acid monoethyl ester
Type:
Small organic molecule
Emp. Form.:
C26H38N5O7PS
Mol. Mass.:
595.648
SMILES:
CCCOc1ccc(cc1-c1nc2c(CCC)nn(C)c2c(=O)[nH]1)S(=O)(=O)N1CCC(CP(O)(=O)OCC)CC1
: