Target
Delta-type opioid receptor
Ligand
BDBM50144249
Substrate
Meas. Tech.
ChEBML_147341
Ki
0.240000±n/a nM
Citation
 Carson, JRCoats, SJCodd, EEDax, SLLee, JMartinez, RPMcKown, LAAnne Neilson, LPitis, PMWu, WNZhang, SP N-alkyl-4-[(8-azabicyclo[3.2.1]-oct-3-ylidene)phenylmethyl]benzamides, micro and delta opioid agonists: a micro address. Bioorg Med Chem Lett 14:2113-6 (2004)  
Target
Name:
Delta-type opioid receptor
Synonyms:
D-OR-1 Delta opioid receptor OPIATE Delta OPRD1 OPRK1 | opioid receptor, delta 1
Type:
G Protein-Coupled Receptor (GPCR)
Mol. Mass.:
40382.98
Organism:
Homo sapiens (Human)
Description:
Competition binding assays were carried out using membrane preparations from transfected HN9.10 cells that constitutively expressed the delta opioid receptor.
Residue:
372
  
Inhibitor
Name:
BDBM50144249
Synonyms:
CHEMBL302801 | N,N-Diethyl-4-{[(1S,5R)-8-phenethyl-8-aza-bicyclo[3.2.1]oct-(3Z)-ylidene]-phenyl-methyl}-benzamide
Type:
Small organic molecule
Emp. Form.:
C33H38N2O
Mol. Mass.:
478.6676
SMILES:
CCN(CC)C(=O)c1ccc(cc1)C(=C1\C[C@@H]2CC[C@H](C1)N2CCc1ccccc1)\c1ccccc1
: