Target
Mu-type opioid receptor
Ligand
BDBM50144281
Substrate
Meas. Tech.
ChEBML_149324
Ki
0.140000±n/a nM
Citation
 Carson, JRCoats, SJCodd, EEDax, SLLee, JMartinez, RPMcKown, LAAnne Neilson, LPitis, PMWu, WNZhang, SP N-alkyl-4-[(8-azabicyclo[3.2.1]-oct-3-ylidene)phenylmethyl]benzamides, micro and delta opioid agonists: a micro address. Bioorg Med Chem Lett 14:2113-6 (2004)  
Target
Name:
Mu-type opioid receptor
Synonyms:
M-OR-1 MOR-1 MUOR1 Mu opiate receptor OPRM1 hMOP | mu-type opioid receptor isoform MOR-1
Type:
G Protein-Coupled Receptor (GPCR)
Mol. Mass.:
44789.51
Organism:
Homo sapiens (Human)
Description:
P35372
Residue:
400
  
Inhibitor
Name:
BDBM50144281
Synonyms:
CHEMBL63309 | N-Methyl-4-[(8-phenethyl-8-aza-bicyclo[3.2.1]oct-3-ylidene)-phenyl-methyl]-benzamide
Type:
Small organic molecule
Emp. Form.:
C30H32N2O
Mol. Mass.:
436.5879
SMILES:
[#6]-[#7]-[#6](=O)-c1ccc(cc1)-[#6](=[#6]-1\[#6]-[#6]-2-[#6]-[#6]-[#6](-[#6]-1)-[#7]-2-[#6]-[#6]-c1ccccc1)\c1ccccc1
: