Target
Sodium-dependent serotonin transporter
Ligand
BDBM50106857
Substrate
Meas. Tech.
ChEBML_201835
Ki
0.062000±n/a nM
Citation
 Bois, FBaldwin, RMKula, NSBaldessarini, RJInnis, RBTamagnan, G Synthesis and monoamine transporter affinity of 3'-analogs of 2-beta-carbomethoxy-3-beta-(4'-iodophenyl)tropane (beta-CIT). Bioorg Med Chem Lett 14:2117-20 (2004)  
Target
Name:
Sodium-dependent serotonin transporter
Synonyms:
5-HT Transporter 5HT transporter Anandamid membrane transporter, AMT Monoamine transporters; Norepinephrine & serotonin Slc6a4 Sodium-dependent serotonin transporter (SERT) | imipramine receptor
Type:
Multi-pass membrane protein
Mol. Mass.:
70168.43
Organism:
Rattus norvegicus (rat)
Description:
P31652
Residue:
630
  
Inhibitor
Name:
BDBM50106857
Synonyms:
3-(4-Iodo-phenyl)-8-aza-bicyclo[3.2.1]octane-2-carboxylic acid methyl ester | CHEMBL14613
Type:
Small organic molecule
Emp. Form.:
C15H18INO2
Mol. Mass.:
371.2134
SMILES:
COC(=O)C1C2CCC(CC1c1ccc(I)cc1)N2
: