Target
C-C chemokine receptor type 1
Ligand
BDBM50144428
Substrate
Meas. Tech.
ChEMBL_86826 (CHEMBL694697)
IC50
1±n/a nM
Citation
 Brown, MFAvery, MBrissette, WHChang, JHColizza, KConklyn, MDiRico, APGladue, RPKath, JCKrueger, SSLira, PDLillie, BMLundquist, GDMairs, ENMcElroy, EBMcGlynn, MAParadis, TJPoss, CSRossulek, MIShepard, RMSims, JStrelevitz, TJTruesdell, STylaska, LAYoon, KZheng, D Novel CCR1 antagonists with improved metabolic stability. Bioorg Med Chem Lett 14:2175-9 (2004)  
Target
Name:
C-C chemokine receptor type 1
Synonyms:
C-C CKR-1 CC-CKR-1 CCR1 CD_antigen=CD191 CMKR1 LD78 receptor Macrophage inflammatory protein 1-alpha receptor SCYAR1
Type:
Enzyme
Mol. Mass.:
41180.69
Organism:
Homo sapiens (Human)
Description:
P32246
Residue:
355
  
Inhibitor
Name:
BDBM50144428
Synonyms:
CHEMBL66159 | Quinoxaline-2-carboxylic acid ((1S,2S)-1-benzyl-7-fluoro-4-hydrazinocarbonyl-2-hydroxy-7-methyl-octyl)-amide
Type:
Small organic molecule
Emp. Form.:
C26H32FN5O3
Mol. Mass.:
481.5624
SMILES:
CC(C)(F)CCC(C[C@H](O)[C@H](Cc1ccccc1)NC(=O)c1cnc2ccccc2n1)C(=O)NN
: