Target
Sigma non-opioid intracellular receptor 1
Ligand
BDBM50144510
Substrate
Meas. Tech.
ChEBML_201915
Ki
20±n/a nM
Citation
 Glennon, RAIsmaiel, AMAblordeppey, SEl-Ashmawy, MFisher, JB Thioxanthene-derived analogs as sigma(1) receptor ligands. Bioorg Med Chem Lett 14:2217-20 (2004)  
Target
Name:
Sigma non-opioid intracellular receptor 1
Synonyms:
Aging-associated gene 8 protein SGMR1_HUMAN SIGMAR1 SR31747-binding protein Sigma 1-type opioid receptor Sigma1R | hSigmaR1
Type:
Enzyme Catalytic Domain
Mol. Mass.:
25124.85
Organism:
Homo sapiens (Human)
Description:
Q99720
Residue:
223
  
Inhibitor
Name:
BDBM50144510
Synonyms:
1-Methyl-4-(4-phenyl-butyl)-piperazine | CHEMBL71616
Type:
Small organic molecule
Emp. Form.:
C15H24N2
Mol. Mass.:
232.3645
SMILES:
CN1CCN(CCCCc2ccccc2)CC1
: