Target
Transient receptor potential cation channel subfamily V member 1
Ligand
BDBM50144675
Substrate
Meas. Tech.
ChEMBL_215815 (CHEMBL820104)
Ki
430±n/a nM
Citation
 Lee, JKang, SUChoi, HKLee, JLim, JOKil, MJJin, MKKim, KPSung, JHChung, SJHa, HJKim, YHPearce, LVTran, RLundberg, DJWang, YToth, ABlumberg, PM Analysis of structure-activity relationships for the 'B-region' of N-(3-acyloxy-2-benzylpropyl)-N(')-[4-(methylsulfonylamino)benzyl]thiourea analogues as vanilloid receptor antagonists: discovery of an N-hydroxythiourea analogue with potent analgesic activity. Bioorg Med Chem Lett 14:2291-7 (2004)  
Target
Name:
Transient receptor potential cation channel subfamily V member 1
Synonyms:
Capsaicin receptor TRPV1_RAT Trpv1 Vanilloid VR1 Vanilloid receptor 1 (VRI/TRPV1) Vanilloid receptor type 1-like (TrpV1/Vr1) Vr1l | osm-9-like TRP channel 1
Type:
Transient Receptor
Mol. Mass.:
94956.12
Organism:
Rattus norvegicus (rat)
Description:
O35433
Residue:
838
  
Inhibitor
Name:
BDBM50144675
Synonyms:
2,2-Dimethyl-propionic acid 2-(3,4-dimethyl-benzyl)-3-[2-(4-methanesulfonylamino-3-methoxy-phenyl)-acetylamino]-propyl ester | CHEMBL308964
Type:
Small organic molecule
Emp. Form.:
C27H38N2O6S
Mol. Mass.:
518.665
SMILES:
COc1cc(CC(=O)NCC(COC(=O)C(C)(C)C)Cc2ccc(C)c(C)c2)ccc1NS(C)(=O)=O
: