Target
5-hydroxytryptamine receptor 2B
Ligand
BDBM50144838
Substrate
Meas. Tech.
ChEMBL_2484 (CHEMBL617371)
EC50
22±n/a nM
Citation
 Bentley, JMAdams, DRBebbington, DBenwell, KRBickerdike, MJDavidson, JEDawson, CEDourish, CTDuncton, MAGaur, SGeorge, ARGiles, PRHamlyn, RJKennett, GAKnight, ARMalcolm, CSMansell, HLMisra, AMonck, NJPratt, RMQuirk, KRoffey, JRVickers, SPCliffe, IA Indoline derivatives as 5-HT(2C) receptor agonists. Bioorg Med Chem Lett 14:2367-70 (2004)  
Target
Name:
5-hydroxytryptamine receptor 2B
Synonyms:
5-HT-2B 5-hydroxytryptamine (serotonin) receptor 2B [Homo sapiens] 5-hydroxytryptamine receptor 2C (5HT2C) HTR2B Serotonin 2b (5-HT2b) receptor | Serotonin Receptor 2B
Type:
G Protein-Coupled Receptor (GPCR)
Mol. Mass.:
54312.47
Organism:
Homo sapiens (Human)
Description:
Receptor binding assays were performed using human clone stably expressed in CHO cells.
Residue:
481
  
Inhibitor
Name:
BDBM50144838
Synonyms:
(S)-2-(5-Fluoro-6-iodo-2,3-dihydro-indol-1-yl)-1-methyl-ethylamine | CHEMBL76301
Type:
Small organic molecule
Emp. Form.:
C11H14FIN2
Mol. Mass.:
320.1451
SMILES:
C[C@H](N)CN1CCc2cc(F)c(I)cc12
: