Target
5-hydroxytryptamine receptor 2A
Ligand
BDBM50144843
Substrate
Meas. Tech.
ChEMBL_2263 (CHEMBL617050)
EC50
1063±n/a nM
Citation
 Bentley, JMAdams, DRBebbington, DBenwell, KRBickerdike, MJDavidson, JEDawson, CEDourish, CTDuncton, MAGaur, SGeorge, ARGiles, PRHamlyn, RJKennett, GAKnight, ARMalcolm, CSMansell, HLMisra, AMonck, NJPratt, RMQuirk, KRoffey, JRVickers, SPCliffe, IA Indoline derivatives as 5-HT(2C) receptor agonists. Bioorg Med Chem Lett 14:2367-70 (2004)  
Target
Name:
5-hydroxytryptamine receptor 2A
Synonyms:
5-HT-2 5-HT2A 5-hydroxytryptamine receptor 2A (5HT-2A) 5HT2A_HUMAN HTR2A | Serotonin receptor 2A
Type:
undefined
Mol. Mass.:
52607.65
Organism:
Homo sapiens (Human)
Description:
P28223
Residue:
471
  
Inhibitor
Name:
BDBM50144843
Synonyms:
(S)-2-(5-Fluoro-6-trifluoromethyl-2,3-dihydro-indol-1-yl)-1-methyl-ethylamine | CHEMBL80246
Type:
Small organic molecule
Emp. Form.:
C12H14F4N2
Mol. Mass.:
262.2466
SMILES:
C[C@H](N)CN1CCc2cc(F)c(cc12)C(F)(F)F
: