Target
Potassium voltage-gated channel subfamily A member 3
Ligand
BDBM50145053
Substrate
Meas. Tech.
ChEMBL_214956 (CHEMBL821185)
Kd
600±n/a nM
Citation
 Baell, JBGable, RWHarvey, AJToovey, NHerzog, THänsel, WWulff, H Khellinone derivatives as blockers of the voltage-gated potassium channel Kv1.3: synthesis and immunosuppressive activity. J Med Chem 47:2326-36 (2004)  
Target
Name:
Potassium voltage-gated channel subfamily A member 3
Synonyms:
HGK5 HPCN3 KCNA3 Potassium voltage-gated channel subfamily A member 3 Voltage-gated potassium channel subunit Kv1.3
Type:
PROTEIN
Mol. Mass.:
63835.47
Organism:
Homo sapiens (Human)
Description:
ChEMBL_1513935
Residue:
575
  
Inhibitor
Name:
BDBM50145053
Synonyms:
1-(6-Hydroxy-4,7-dimethoxy-benzofuran-5-yl)-3-phenyl-propan-1-one | CHEMBL76997
Type:
Small organic molecule
Emp. Form.:
C19H18O5
Mol. Mass.:
326.3432
SMILES:
COc1c(O)c(C(=O)CCc2ccccc2)c(OC)c2ccoc12
: