Target
Integrase
Ligand
BDBM50087426
Substrate
Meas. Tech.
ChEBML_88783
IC50
2300±n/a nM
Citation
 Bénard, CZouhiri, FNormand-Bayle, MDanet, MDesmaële, DLeh, HMouscadet, JFMbemba, GThomas, CMBonnenfant, SLe Bret, Md'Angelo, J Linker-modified quinoline derivatives targeting HIV-1 integrase: synthesis and biological activity. Bioorg Med Chem Lett 14:2473-6 (2004)  
Target
Name:
Integrase
Synonyms:
Human immunodeficiency virus type 1 integrase
Type:
PROTEIN
Mol. Mass.:
32231.48
Organism:
Human immunodeficiency virus 1
Description:
ChEMBL_90865
Residue:
288
  
Inhibitor
Name:
BDBM50087426
Synonyms:
2-(3,4-dihydroxyphenethyl)-8-hydroxyquinoline-7-carboxylic acid CHEMBL289303
Type:
Small organic molecule
Emp. Form.:
C18H15NO5
Mol. Mass.:
325.3154
SMILES:
OC(=O)c1ccc2ccc(CCc3ccc(O)c(O)c3)nc2c1O
: