Target
Vitamin D3 receptor
Ligand
BDBM50404242
Substrate
Meas. Tech.
ChEBML_214183
IC50
30±n/a nM
Citation
 Kato, YNakano, YSano, HTanatani, AKobayashi, HShimazawa, RKoshino, HHashimoto, YNagasawa, K Synthesis of 1alpha,25-dihydroxyvitamin D3-26,23-lactams (DLAMs), a novel series of 1 alpha,25-dihydroxyvitamin D3 antagonist. Bioorg Med Chem Lett 14:2579-83 (2004)  
Target
Name:
Vitamin D3 receptor
Synonyms:
NR1I1 VDR_CHICK | Vitamin D receptor
Type:
PROTEIN
Mol. Mass.:
51292.53
Organism:
Gallus gallus
Description:
ChEMBL_214183
Residue:
451
  
Inhibitor
Name:
BDBM50404242
Synonyms:
CHEMBL2114211
Type:
Small organic molecule
Emp. Form.:
C34H47NO4
Mol. Mass.:
533.7413
SMILES:
C[C@H](C[C@@H]1C[C@@](C)(O)C(=O)N1Cc1ccccc1)C1CCC2\C(CCC[C@]12C)=C/C=C1\C[C@@H](O)C[C@H](O)C1=C
: