Target
Corticotropin-releasing factor receptor 1
Ligand
BDBM50145751
Substrate
Meas. Tech.
ChEMBL_51106 (CHEMBL666467)
Ki
244±n/a nM
Citation
 Molteni, VPenzotti, JWilson, DMTermin, APMao, LCrane, CMHassman, FWang, TWong, HMiller, KJGrossman, SGrootenhuis, PD N-phenylphenylglycines as novel corticotropin releasing factor receptor antagonists. J Med Chem 47:2426-9 (2004)  
Target
Name:
Corticotropin-releasing factor receptor 1
Synonyms:
CRF-R CRF1 CRFR1 CRH-R 1 CRHR1 Corticotropin-releasing factor receptor 1 (CRF-1) Corticotropin-releasing hormone receptor 1
Type:
Enzyme
Mol. Mass.:
50744.31
Organism:
Homo sapiens (Human)
Description:
P34998
Residue:
444
  
Inhibitor
Name:
BDBM50145751
Synonyms:
(R)-1-(2-Chloro-4-methyl-phenylamino)-4-pyridin-4-yl-1-o-tolyl-butan-2-one | CHEMBL79502
Type:
Small organic molecule
Emp. Form.:
C23H23ClN2O
Mol. Mass.:
378.895
SMILES:
Cc1ccc(N[C@@H](C(=O)CCc2ccncc2)c2ccccc2C)c(Cl)c1
: