Target
Dihydrofolate reductase
Ligand
BDBM50145798
Substrate
Meas. Tech.
ChEMBL_54758 (CHEMBL884428)
IC50
2±n/a nM
Citation
 Rosowsky, AFu, HChan, DCQueener, SF Synthesis of 2,4-diamino-6-[2'-O-(omega-carboxyalkyl)oxydibenz[b,f]azepin-5-yl]methylpteridines as potent and selective inhibitors of Pneumocystis carinii, Toxoplasma gondii, and Mycobacterium avium dihydrofolate reductase. J Med Chem 47:2475-85 (2004)  
Target
Name:
Dihydrofolate reductase
Synonyms:
DHFR Dihydrofolate reductase (DHFR) | Tetrahydrofolate dehydrogenase
Type:
Enzyme
Mol. Mass.:
21453.99
Organism:
Homo sapiens (Human)
Description:
Recombinant human DHFR.
Residue:
187
  
Inhibitor
Name:
BDBM50145798
Synonyms:
4-[5-(2,4-Diamino-pteridin-6-ylmethyl)-5H-dibenzo[b,f]azepin-2-yloxy]-butyric acid | CHEMBL430821
Type:
Small organic molecule
Emp. Form.:
C25H23N7O3
Mol. Mass.:
469.4952
SMILES:
Nc1nc(N)c2nc(CN3c4ccccc4C=Cc4cc(OCCCC(O)=O)ccc34)cnc2n1
: