Target
NAD-dependent histone deacetylase SIR2
Ligand
BDBM50146058
Substrate
Meas. Tech.
ChEBML_202251
IC50
8800.0±n/a nM
Citation
 Posakony, JHirao, MStevens, SSimon, JABedalov, A Inhibitors of Sir2: evaluation of splitomicin analogues. J Med Chem 47:2635-44 (2004)  
Target
Name:
NAD-dependent histone deacetylase SIR2
Synonyms:
MAR1 SIR2_YEAST
Type:
PROTEIN
Mol. Mass.:
63277.80
Organism:
Saccharomyces cerevisiae
Description:
ChEMBL_942450
Residue:
562
  
Inhibitor
Name:
BDBM50146058
Synonyms:
Benzo[de]isochromene-1,3-dione | CHEMBL316059
Type:
Small organic molecule
Emp. Form.:
C12H6O3
Mol. Mass.:
198.1742
SMILES:
O=C1OC(=O)c2cccc3cccc1c23
: