Target
5-hydroxytryptamine receptor 1A
Ligand
BDBM50146094
Substrate
Meas. Tech.
ChEMBL_1303 (CHEMBL616680)
Ki
10.4±n/a nM
Citation
 Jurczyk, SKlodzinska, MMaryniak, EZajdel, PPawlowski, MTatarczynska, EKlodzinska, AChojnacka-Wójcik, EBojarski, AJCharakchieva-Minol, SDuszynska, BNowak, GMaciag, D New arylpiperazine 5-HT(1A) receptor ligands containing the pyrimido[2,1-f]purine fragment: synthesis, in vitro, and in vivo pharmacological evaluation. J Med Chem 47:2659-66 (2004)  
Target
Name:
5-hydroxytryptamine receptor 1A
Synonyms:
5-HT-1A 5-HT1A 5-hydroxytryptamine receptor 1A (5HT1A) 5ht1a Htr1a Serotonin 1a (5-HT1a) receptor/Adrenergic receptor alpha-1 | Serotonin receptor 1A
Type:
G Protein-Coupled Receptor (GPCR)
Mol. Mass.:
46445.29
Organism:
Rattus norvegicus (rat)
Description:
Binding assays were performed using rat hippocampal membranes.
Residue:
422
  
Inhibitor
Name:
BDBM50146094
Synonyms:
8-{3-[4-(2-Methoxy-phenyl)-piperazin-1-yl]-propyl}-1,3-dimethyl-1H,8H-1,3,4b,8,9-pentaaza-fluorene-2,4,7-trione | CHEMBL91588
Type:
Small organic molecule
Emp. Form.:
C24H29N7O4
Mol. Mass.:
479.5316
SMILES:
COc1ccccc1N1CCN(CCCn2c3nc4n(C)c(=O)n(C)c(=O)c4n3ccc2=O)CC1
: