Target
Lysophosphatidic acid receptor 1
Ligand
BDBM50146246
Substrate
Meas. Tech.
ChEBML_100171
IC50
>10000±n/a nM
Citation
 Heasley, BHJarosz, RLynch, KRMacdonald, TL Initial structure-activity relationships of lysophosphatidic acid receptor antagonists: discovery of a high-affinity LPA1/LPA3 receptor antagonist. Bioorg Med Chem Lett 14:2735-40 (2004)  
Target
Name:
Lysophosphatidic acid receptor 1
Synonyms:
EDG2 LPA-1 LPAR1 Lysophosphatidic acid receptor 1 (LPA1) | Lysophosphatidic acid receptor Edg-2
Type:
Enzyme
Mol. Mass.:
41120.55
Organism:
Homo sapiens (Human)
Description:
Q92633
Residue:
364
  
Inhibitor
Name:
BDBM50146246
Synonyms:
4-Pentyl-benzoic acid 4-[(S)-2-((Z)-octadec-9-enoylamino)-3-phosphonooxy-propyl]-phenyl ester | CHEMBL314553
Type:
Small organic molecule
Emp. Form.:
C39H60NO7P
Mol. Mass.:
685.87
SMILES:
CCCCCCCC\C=C/CCCCCCCC(=O)N[C@H](COP(O)(O)=O)Cc1ccc(OC(=O)c2ccc(CCCCC)cc2)cc1
: