Target
Lysophosphatidic acid receptor 1
Ligand
BDBM50146249
Substrate
Meas. Tech.
ChEBML_100171
IC50
>10000±n/a nM
Citation
 Heasley, BHJarosz, RLynch, KRMacdonald, TL Initial structure-activity relationships of lysophosphatidic acid receptor antagonists: discovery of a high-affinity LPA1/LPA3 receptor antagonist. Bioorg Med Chem Lett 14:2735-40 (2004)  
Target
Name:
Lysophosphatidic acid receptor 1
Synonyms:
EDG2 LPA-1 LPAR1 Lysophosphatidic acid receptor 1 (LPA1) | Lysophosphatidic acid receptor Edg-2
Type:
Enzyme
Mol. Mass.:
41120.55
Organism:
Homo sapiens (Human)
Description:
Q92633
Residue:
364
  
Inhibitor
Name:
BDBM50146249
Synonyms:
CHEMBL328474 | Phosphoric acid mono-[(S)-2-((Z)-octadec-9-enoylamino)-3-(4-prop-2-ynyloxy-phenyl)-propyl] ester
Type:
Small organic molecule
Emp. Form.:
C30H48NO6P
Mol. Mass.:
549.679
SMILES:
CCCCCCCC\C=C/CCCCCCCC(=O)N[C@H](COP(O)(O)=O)Cc1ccc(OCC#C)cc1
: