Target
5-hydroxytryptamine receptor 2A
Ligand
BDBM50146345
Substrate
Meas. Tech.
ChEBML_2276
Ki
37±n/a nM
Citation
 Cid, JAlonso, JMAndrés, JIFernández, JGil, PIturrino, LMatesanz, EMeert, TFMegens, ASipido, VKTrabanco, AA Synthesis and structure-activity relationship of 2-(aminoalkyl)-3,3a,8,12b-tetrahydro-2H-dibenzocyclohepta[1,2-b]furan derivatives: a novel series of 5-HT(2A/2C) receptor antagonists. Bioorg Med Chem Lett 14:2765-71 (2004)  
Target
Name:
5-hydroxytryptamine receptor 2A
Synonyms:
5-HT-2 5-HT2A 5-hydroxytryptamine receptor 2A (5HT-2A) 5HT2A_HUMAN HTR2A | Serotonin receptor 2A
Type:
undefined
Mol. Mass.:
52607.65
Organism:
Homo sapiens (Human)
Description:
P28223
Residue:
471
  
Inhibitor
Name:
BDBM50146345
Synonyms:
CHEMBL96158 | Dimethyl-[(3aR,12bS)-1-(2,3,3a,12b-tetrahydro-1,8-dioxa-dibenzo[e,h]azulen-2-yl)methyl]-amine
Type:
Small organic molecule
Emp. Form.:
C19H21NO2
Mol. Mass.:
295.3755
SMILES:
CN(C)CC1C[C@H]2[C@H](O1)c1ccccc1Oc1ccccc21
: