Target
Alpha-2C adrenergic receptor
Ligand
BDBM50146510
Substrate
Meas. Tech.
ChEBML_33535
Ki
0.200000±n/a nM
Citation
 Pastor, JAlcázar, JAlvarez, RMAndrés, JICid, JMDe Lucas, AIDíaz, AFernández, JFont, LMIturrino, LLafuente, CMartínez, SBakker, MHBiesmans, IHeylen, LIMegens, AA Synthesis of 3a,4-dihydro-3H-[1]benzopyrano[4,3-c]isoxazoles, displaying combined 5-HT uptake inhibiting and alpha2-adrenoceptor antagonistic activities. Part 2: Further exploration on the cinnamyl moiety. Bioorg Med Chem Lett 14:2917-22 (2004)  
Target
Name:
Alpha-2C adrenergic receptor
Synonyms:
ADA2C_HUMAN ADRA2L2 Adrenergic alpha2C Adrenergic receptor alpha Alpha-2 adrenergic receptor subtype C4 Alpha-2C adrenoreceptor | adrenergic, alpha-2C-, receptor [Homo sapiens]
Type:
Enzyme
Mol. Mass.:
49552.32
Organism:
Homo sapiens (Human)
Description:
P18825
Residue:
462
  
Inhibitor
Name:
BDBM50146510
Synonyms:
(3R,3aS)-7,8-Dimethoxy-3-[4-(2-methyl-3-thiophen-3-yl-allyl)-piperazin-1-ylmethyl]-3a,4-dihydro-3H-chromeno[4,3-c]isoxazole | CHEMBL101596
Type:
Small organic molecule
Emp. Form.:
C25H31N3O4S
Mol. Mass.:
469.596
SMILES:
COc1cc2OC[C@H]3[C@H](CN4CCN(C\C(C)=C\c5ccsc5)CC4)ON=C3c2cc1OC
: