Target
Prothrombin
Ligand
BDBM50146534
Substrate
Meas. Tech.
ChEBML_208709
IC50
560±n/a nM
Citation
 Haginoya, NKobayashi, SKomoriya, SHirokawa, YFurugori, TNagahara, T Orally active factor Xa inhibitors: 4,5,6,7-tetrahydrothiazolo[5,4-c]pyridine derivatives. Bioorg Med Chem Lett 14:2935-9 (2004)  
Target
Name:
Prothrombin
Synonyms:
Activation peptide fragment 1 Coagulation factor II Prothrombin precursor Thrombin heavy chain | Thrombin light chain
Type:
Protein
Mol. Mass.:
70029.57
Organism:
Homo sapiens (Human)
Description:
P00734
Residue:
622
  
Inhibitor
Name:
BDBM50146534
Synonyms:
CHEMBL100732 | [4-(6-Chloro-naphthalene-2-sulfonyl)-piperazin-1-yl]-(5-methyl-4,5,6,7-tetrahydro-thiazolo[5,4-c]pyridin-2-yl)-methanone
Type:
Small organic molecule
Emp. Form.:
C22H23ClN4O3S2
Mol. Mass.:
491.026
SMILES:
CN1CCc2nc(sc2C1)C(=O)N1CCN(CC1)S(=O)(=O)c1ccc2cc(Cl)ccc2c1
: