Target
cGMP-dependent 3',5'-cyclic phosphodiesterase
Ligand
BDBM14769
Substrate
Meas. Tech.
ChEBML_156330
IC50
>10000±n/a nM
Citation
 Pitts, WJVaccaro, WHuynh, TLeftheris, KRoberge, JYBarbosa, JGuo, JBrown, BWatson, ADonaldson, KStarling, GCKiener, PAPoss, MADodd, JHBarrish, JC Identification of purine inhibitors of phosphodiesterase 7 (PDE7). Bioorg Med Chem Lett 14:2955-8 (2004)  
Target
Name:
cGMP-dependent 3',5'-cyclic phosphodiesterase
Synonyms:
PDE2A_RAT Phosphodiesterase 2A
Type:
PROTEIN
Mol. Mass.:
104640.72
Organism:
Rattus norvegicus
Description:
ChEMBL_156330
Residue:
928
  
Inhibitor
Name:
BDBM14769
Synonyms:
6-(3,4-Dimethoxy-phenyl)-4,5-dimethyl-4,5-dihydro-2H-pyridazin-3-one 6-(4-Difluoromethoxy-3-methoxy-phenyl)-2H-pyridazin-3-one CHEMBL313842 Zardaverine
Type:
Small organic molecule
Emp. Form.:
C12H10F2N2O3
Mol. Mass.:
268.2162
SMILES:
COc1cc(ccc1OC(F)F)-c1ccc(=O)[nH]n1
: