Target
Protein kinase C alpha type
Ligand
BDBM50146554
Substrate
Meas. Tech.
ChEBML_160132
Ki
540±n/a nM
Citation
 Baba, YOgoshi, YHirai, GYanagisawa, TNagamatsu, KMayumi, SHashimoto, YSodeoka, M Design, synthesis, and structure-activity relationship of new isobenzofuranone ligands of protein kinase C. Bioorg Med Chem Lett 14:2963-7 (2004)  
Target
Name:
Protein kinase C alpha type
Synonyms:
KPCA_HUMAN PKC alpha and beta-2 PKC-alpha PRKACA Protein Kinase C- alpha Protein kinase C alpha (PKCa) Protein kinase C alpha type (PRKCA) RAF proto-oncogene serine/threonine-protein kinase
Type:
Enzyme
Mol. Mass.:
76755.65
Organism:
Homo sapiens (Human)
Description:
The recombinant human PKC enzymes were produced using a baculovirus expression system in SF9 cells
Residue:
672
  
Inhibitor
Name:
BDBM50146554
Synonyms:
CHEMBL102042 | Octanoic acid (S)-2-acetoxy-3-hydroxy-propyl ester
Type:
Small organic molecule
Emp. Form.:
C13H24O5
Mol. Mass.:
260.3267
SMILES:
CCCCCCCC(=O)OC[C@H](CO)OC(C)=O
: