Target
Dipeptidyl peptidase 2
Ligand
BDBM50146958
Substrate
Meas. Tech.
ChEMBL_53368 (CHEMBL666614)
IC50
4±n/a nM
Citation
 Senten, KVan Der Veken, PDe Meester, ILambeir, AMScharpé, SHaemers, AAugustyns, K Gamma-amino-substituted analogues of 1-[(S)-2,4-diaminobutanoyl]piperidine as highly potent and selective dipeptidyl peptidase II inhibitors. J Med Chem 47:2906-16 (2004)  
Target
Name:
Dipeptidyl peptidase 2
Synonyms:
DAP II DPP2_HUMAN Dipeptidyl aminopeptidase II Dipeptidyl peptidase 2 (DPP2) Dipeptidyl peptidase II (DPP II) Dipeptidyl peptidase II and dipeptidyl peptidase IV (DPP2 and DPP4) carboxytripeptidase dipeptidyl(amino)peptidase II | dipeptidylarylamidase
Type:
Protein
Mol. Mass.:
54339.29
Organism:
Homo sapiens (Human)
Description:
Q9UHL4
Residue:
492
  
Inhibitor
Name:
BDBM50146958
Synonyms:
1-((S)-2-Amino-4-benzylamino-butyryl)-piperidine-2-carbonitrile | CHEMBL329314
Type:
Small organic molecule
Emp. Form.:
C17H24N4O
Mol. Mass.:
300.3987
SMILES:
N[C@@H](CCNCc1ccccc1)C(=O)N1CCCCC1C#N
: