Target
Dipeptidyl peptidase 2
Ligand
BDBM50146972
Substrate
Meas. Tech.
ChEMBL_53368 (CHEMBL666614)
IC50
0.48±n/a nM
Citation
 Senten, KVan Der Veken, PDe Meester, ILambeir, AMScharpé, SHaemers, AAugustyns, K Gamma-amino-substituted analogues of 1-[(S)-2,4-diaminobutanoyl]piperidine as highly potent and selective dipeptidyl peptidase II inhibitors. J Med Chem 47:2906-16 (2004)  
Target
Name:
Dipeptidyl peptidase 2
Synonyms:
DAP II DPP2_HUMAN Dipeptidyl aminopeptidase II Dipeptidyl peptidase 2 (DPP2) Dipeptidyl peptidase II (DPP II) Dipeptidyl peptidase II and dipeptidyl peptidase IV (DPP2 and DPP4) carboxytripeptidase dipeptidyl(amino)peptidase II | dipeptidylarylamidase
Type:
Protein
Mol. Mass.:
54339.29
Organism:
Homo sapiens (Human)
Description:
Q9UHL4
Residue:
492
  
Inhibitor
Name:
BDBM50146972
Synonyms:
(S)-4-(4-chlorobenzylamino)-2-amino-1-(piperidin-1-yl)butan-1-one CHEMBL98869 | N4-(4-chlorobenzyl)-2,4-diaminobutanoylpiperidine
Type:
Small organic molecule
Emp. Form.:
C16H24ClN3O
Mol. Mass.:
309.834
SMILES:
N[C@@H](CCNCc1ccc(Cl)cc1)C(=O)N1CCCCC1
: