Target
Dipeptidyl peptidase 2
Ligand
BDBM50118950
Substrate
Meas. Tech.
ChEMBL_53368 (CHEMBL666614)
IC50
130±n/a nM
Citation
 Senten, KVan Der Veken, PDe Meester, ILambeir, AMScharpé, SHaemers, AAugustyns, K Gamma-amino-substituted analogues of 1-[(S)-2,4-diaminobutanoyl]piperidine as highly potent and selective dipeptidyl peptidase II inhibitors. J Med Chem 47:2906-16 (2004)  
Target
Name:
Dipeptidyl peptidase 2
Synonyms:
DAP II DPP2_HUMAN Dipeptidyl aminopeptidase II Dipeptidyl peptidase 2 (DPP2) Dipeptidyl peptidase II (DPP II) Dipeptidyl peptidase II and dipeptidyl peptidase IV (DPP2 and DPP4) carboxytripeptidase dipeptidyl(amino)peptidase II | dipeptidylarylamidase
Type:
Protein
Mol. Mass.:
54339.29
Organism:
Homo sapiens (Human)
Description:
Q9UHL4
Residue:
492
  
Inhibitor
Name:
BDBM50118950
Synonyms:
(3S)-4-oxo-4-piperidin-1-ylbutane-1,3-diamine CHEMBL93505 | Dab-Pip
Type:
Small organic molecule
Emp. Form.:
C9H19N3O
Mol. Mass.:
185.2667
SMILES:
NCC[C@H](N)C(=O)N1CCCCC1
: