Target
Alpha-1A/Alpha-1B/Alpha-1D adrenergic receptor
Ligand
BDBM50005833
Substrate
Meas. Tech.
ChEMBL_33427 (CHEMBL648823)
Ki
>10000±n/a nM
Citation
 Becker, DPFlynn, DLVillamil, CI Bridgehead-methyl analog of SC-53116 as a 5-HT4 agonist. Bioorg Med Chem Lett 14:3073-5 (2004)  
Target
Name:
Alpha-1A/Alpha-1B/Alpha-1D adrenergic receptor
Synonyms:
Adrenergic receptor alpha-1
Type:
Mol. Mass.:
Description:
ASSAY_ID of ChEMBL is 306566
Components:
This complex has 3 components.
Component 1
Name:
Alpha-1D adrenergic receptor
Synonyms:
ADA1D_HUMAN ADRA1D Adrenergic receptor alpha Alpha 1D-adrenoreceptor Alpha-1D adrenoceptor adrenergic Alpha1D
Type:
Enzyme Catalytic Domain
Mol. Mass.:
60485.82
Organism:
Homo sapiens (Human)
Description:
adrenergic Alpha1D ADRA1D HUMAN::P25100
Residue:
572
  
Component 2
Name:
Alpha-1B adrenergic receptor
Synonyms:
ADA1B_HUMAN Adrenergic alpha1B Adrenergic receptor alpha Alpha 1B-adrenoreceptor | Alpha-1B adrenergic receptor
Type:
Enzyme
Mol. Mass.:
56862.13
Organism:
Homo sapiens (Human)
Description:
P35368
Residue:
520
  
Component 3
Name:
Alpha-1A adrenergic receptor
Synonyms:
ADA1A_HUMAN ADRA1C Alpha 1A-adrenoceptor Alpha adrenergic receptor 1a Alpha-adrenergic receptor 1c adrenergic Alpha1 | adrenergic Alpha1C
Type:
Cell-surface receptors
Mol. Mass.:
51511.67
Organism:
Homo sapiens (Human)
Description:
P35348
Residue:
466
  
Inhibitor
Name:
BDBM50005833
Synonyms:
(exo)4-Amino-5-chloro-N-(hexahydro-pyrrolizin-1-ylmethyl)-2-methoxy-benzamide 4-Amino-5-chloro-N-(hexahydro-pyrrolizin-2-ylmethyl)-2-methoxy-benzamide 4-amino-5-chloro-N-[(1S-cis-hexahydro-1H-pyrrolizin-1-yl)-methyl]-2-methoxybenzenecarboxamide SC-53116 SC53116
Type:
Small organic molecule
Emp. Form.:
C16H22ClN3O2
Mol. Mass.:
323.818
SMILES:
COc1cc(N)c(Cl)cc1C(=O)NC[C@@H]1CCN2CCC[C@@H]12
: