Target
Hormone-sensitive lipase
Ligand
BDBM50147253
Substrate
Meas. Tech.
ChEMBL_517 (CHEMBL615539)
IC50
4±n/a nM
Citation
 Lowe, DBMagnuson, SQi, NCampbell, AMCook, JHong, ZWang, MRodriguez, MAchebe, FKluender, HWong, WCBullock, WHSalhanick, AIWitman-Jones, TBowling, MEKeiper, CClairmont, KB In vitro SAR of (5-(2H)-isoxazolonyl) ureas, potent inhibitors of hormone-sensitive lipase. Bioorg Med Chem Lett 14:3155-9 (2004)  
Target
Name:
Hormone-sensitive lipase
Synonyms:
HSL Hormone-sensitive lipase (HSL) LIPS_HUMAN
Type:
Protein
Mol. Mass.:
116599.07
Organism:
Homo sapiens (Human)
Description:
Q05469
Residue:
1076
  
Inhibitor
Name:
BDBM50147253
Synonyms:
2-(4-(3-fluorophenyl)piperidine-1-carbonyl)-4-isopropyl-3-methylisoxazol-5(2H)-one CHEMBL108523
Type:
Small organic molecule
Emp. Form.:
C19H23FN2O3
Mol. Mass.:
346.3959
SMILES:
CC(C)c1c(C)n(oc1=O)C(=O)N1CCC(CC1)c1cccc(F)c1
: