Target
Hormone-sensitive lipase
Ligand
BDBM50147237
Substrate
Meas. Tech.
ChEBML_88045
IC50
111±n/a nM
Citation
 Lowe, DBMagnuson, SQi, NCampbell, AMCook, JHong, ZWang, MRodriguez, MAchebe, FKluender, HWong, WCBullock, WHSalhanick, AIWitman-Jones, TBowling, MEKeiper, CClairmont, KB In vitro SAR of (5-(2H)-isoxazolonyl) ureas, potent inhibitors of hormone-sensitive lipase. Bioorg Med Chem Lett 14:3155-9 (2004)  
Target
Name:
Hormone-sensitive lipase
Synonyms:
HSL Hormone-sensitive lipase (HSL) LIPS_HUMAN
Type:
Protein
Mol. Mass.:
116599.07
Organism:
Homo sapiens (Human)
Description:
Q05469
Residue:
1076
  
Inhibitor
Name:
BDBM50147237
Synonyms:
4-Isopropyl-3-methyl-5-oxo-5H-isoxazole-2-carboxylic acid (4-fluoro-benzyl)-methyl-amide N-(4-fluorobenzyl)-4-isopropyl-N,3-dimethyl-5-oxoisoxazole-2(5H)-carboxamide
Type:
Small organic molecule
Emp. Form.:
C16H19FN2O3
Mol. Mass.:
306.3321
SMILES:
CC(C)c1c(C)n(oc1=O)C(=O)N(C)Cc1ccc(F)cc1
: