Target
Hormone-sensitive lipase
Ligand
BDBM50147250
Substrate
Meas. Tech.
ChEMBL_517 (CHEMBL615539)
IC50
1270±n/a nM
Citation
 Lowe, DBMagnuson, SQi, NCampbell, AMCook, JHong, ZWang, MRodriguez, MAchebe, FKluender, HWong, WCBullock, WHSalhanick, AIWitman-Jones, TBowling, MEKeiper, CClairmont, KB In vitro SAR of (5-(2H)-isoxazolonyl) ureas, potent inhibitors of hormone-sensitive lipase. Bioorg Med Chem Lett 14:3155-9 (2004)  
Target
Name:
Hormone-sensitive lipase
Synonyms:
HSL Hormone-sensitive lipase (HSL) LIPS_HUMAN
Type:
Protein
Mol. Mass.:
116599.07
Organism:
Homo sapiens (Human)
Description:
Q05469
Residue:
1076
  
Inhibitor
Name:
BDBM50147250
Synonyms:
4-(4-Chloro-benzenesulfonyl)-3-methyl-2-(piperidine-1-carbonyl)-2H-isoxazol-5-one CHEMBL108326
Type:
Small organic molecule
Emp. Form.:
C16H17ClN2O5S
Mol. Mass.:
384.835
SMILES:
Cc1c(c(=O)on1C(=O)N1CCCCC1)S(=O)(=O)c1ccc(Cl)cc1
: