Target
Hormone-sensitive lipase
Ligand
BDBM50147295
Substrate
Meas. Tech.
ChEMBL_88045 (CHEMBL695907)
IC50
250±n/a nM
Citation
 Lowe, DBMagnuson, SQi, NCampbell, AMCook, JHong, ZWang, MRodriguez, MAchebe, FKluender, HWong, WCBullock, WHSalhanick, AIWitman-Jones, TBowling, MEKeiper, CClairmont, KB In vitro SAR of (5-(2H)-isoxazolonyl) ureas, potent inhibitors of hormone-sensitive lipase. Bioorg Med Chem Lett 14:3155-9 (2004)  
Target
Name:
Hormone-sensitive lipase
Synonyms:
HSL Hormone-sensitive lipase (HSL) LIPS_HUMAN
Type:
Protein
Mol. Mass.:
116599.07
Organism:
Homo sapiens (Human)
Description:
Q05469
Residue:
1076
  
Inhibitor
Name:
BDBM50147295
Synonyms:
2-(4-Benzoyl-piperidine-1-carbonyl)-4-isopropyl-3-methyl-2H-isoxazol-5-one CHEMBL106927
Type:
Small organic molecule
Emp. Form.:
C20H24N2O4
Mol. Mass.:
356.4156
SMILES:
CC(C)c1c(C)n(oc1=O)C(=O)N1CCC(CC1)C(=O)c1ccccc1
: