Target
Protein kinase C alpha type
Ligand
BDBM50147473
Substrate
Meas. Tech.
ChEBML_152986
IC50
4400±n/a nM
Citation
 Zhang, HCYe, HConway, BRDerian, CKAddo, MFKuo, GHHecker, LRCroll, DRLi, JWestover, LXu, JZLook, RDemarest, KTAndrade-Gordon, PDamiano, BPMaryanoff, BE 3-(7-Azaindolyl)-4-arylmaleimides as potent, selective inhibitors of glycogen synthase kinase-3. Bioorg Med Chem Lett 14:3245-50 (2004)  
Target
Name:
Protein kinase C alpha type
Synonyms:
KPCA_HUMAN PKC alpha and beta-2 PKC-alpha PRKACA Protein Kinase C- alpha Protein kinase C alpha (PKCa) Protein kinase C alpha type (PRKCA) RAF proto-oncogene serine/threonine-protein kinase
Type:
Enzyme
Mol. Mass.:
76755.65
Organism:
Homo sapiens (Human)
Description:
The recombinant human PKC enzymes were produced using a baculovirus expression system in SF9 cells
Residue:
672
  
Inhibitor
Name:
BDBM50147473
Synonyms:
3-(2-Chloro-phenyl)-4-[1-(3-hydroxy-propyl)-1H-pyrrolo[2,3-b]pyridin-3-yl]-pyrrole-2,5-dione | CHEMBL326971
Type:
Small organic molecule
Emp. Form.:
C20H16ClN3O3
Mol. Mass.:
381.812
SMILES:
OCCCn1cc(C2=C(C(=O)NC2=O)c2ccccc2Cl)c2cccnc12
: