Target
Protein kinase C beta type
Ligand
BDBM50147459
Substrate
Meas. Tech.
ChEBML_152990
IC50
1880±n/a nM
Citation
 Zhang, HCYe, HConway, BRDerian, CKAddo, MFKuo, GHHecker, LRCroll, DRLi, JWestover, LXu, JZLook, RDemarest, KTAndrade-Gordon, PDamiano, BPMaryanoff, BE 3-(7-Azaindolyl)-4-arylmaleimides as potent, selective inhibitors of glycogen synthase kinase-3. Bioorg Med Chem Lett 14:3245-50 (2004)  
Target
Name:
Protein kinase C beta type
Synonyms:
KPCB_HUMAN PKC beta PKCB PRKCB1 Protein kinase C beta type | Protein kinase C beta type II (PRKCB2)
Type:
Enzyme
Mol. Mass.:
76873.67
Organism:
Homo sapiens (Human)
Description:
The recombinant human PKC enzymes were produced using a baculovirus expression system in SF9 cells
Residue:
671
  
Inhibitor
Name:
BDBM50147459
Synonyms:
CHEMBL326208 | N-(3-{3-[4-(2-Methoxy-phenyl)-2,5-dioxo-2,5-dihydro-1H-pyrrol-3-yl]-pyrrolo[2,3-b]pyridin-1-yl}-propyl)-methanesulfonamide
Type:
Small organic molecule
Emp. Form.:
C22H22N4O5S
Mol. Mass.:
454.499
SMILES:
COc1ccccc1C1=C(C(=O)NC1=O)c1cn(CCCNS(C)(=O)=O)c2ncccc12
: