Target
Dynamin-1
Ligand
BDBM50147574
Substrate
Meas. Tech.
ChEBML_60874
IC50
39650±n/a nM
Citation
 Hill, TAOdell, LRQuan, AAbagyan, RFerguson, GRobinson, PJMcCluskey, A Long chain amines and long chain ammonium salts as novel inhibitors of dynamin GTPase activity. Bioorg Med Chem Lett 14:3275-8 (2004)  
Target
Name:
Dynamin-1
Synonyms:
DNM DYN1_HUMAN | Dynamin-1
Type:
PROTEIN
Mol. Mass.:
97411.67
Organism:
Homo sapiens (Human)
Description:
ChEMBL_1458576
Residue:
864
  
Inhibitor
Name:
BDBM50147574
Synonyms:
1,12-diaminododecane dodecane-1,12-diamine
Type:
Small organic molecule
Emp. Form.:
C12H28N2
Mol. Mass.:
200.3641
SMILES:
NCCCCCCCCCCCCN
: