Target
Dynamin-1
Ligand
BDBM50147577
Substrate
Meas. Tech.
ChEBML_60874
IC50
8450.0±n/a nM
Citation
 Hill, TAOdell, LRQuan, AAbagyan, RFerguson, GRobinson, PJMcCluskey, A Long chain amines and long chain ammonium salts as novel inhibitors of dynamin GTPase activity. Bioorg Med Chem Lett 14:3275-8 (2004)  
Target
Name:
Dynamin-1
Synonyms:
DNM DYN1_HUMAN | Dynamin-1
Type:
PROTEIN
Mol. Mass.:
97411.67
Organism:
Homo sapiens (Human)
Description:
ChEMBL_1458576
Residue:
864
  
Inhibitor
Name:
BDBM50147577
Synonyms:
CHEMBL109914 | Triethyl-tetradecyl-ammonium; bromide
Type:
Small organic molecule
Emp. Form.:
C20H44N
Mol. Mass.:
298.5695
SMILES:
CCCCCCCCCCCCCC[N+](CC)(CC)CC
: