Target
Kappa-type opioid receptor
Ligand
BDBM50148077
Substrate
Meas. Tech.
ChEMBL_145819 (CHEMBL753530)
Ki
441000±n/a nM
Citation
 Spetea, MSchüllner, FMoisa, RCBerzetei-Gurske, IPSchraml, BDörfler, CAceto, MDHarris, LSCoop, ASchmidhammer, H Synthesis and biological evaluation of 14-alkoxymorphinans. 21. Novel 4-alkoxy and 14-phenylpropoxy derivatives of the mu opioid receptor antagonist cyprodime. J Med Chem 47:3242-7 (2004)  
Target
Name:
Kappa-type opioid receptor
Synonyms:
KOR-1 OPIATE Kappa Opioid receptor Ror-d
Type:
G Protein-Coupled Receptor (GPCR)
Mol. Mass.:
42692.90
Organism:
Rattus norvegicus (rat)
Description:
P34975
Residue:
380
  
Inhibitor
Name:
BDBM50148077
Synonyms:
17-cyclopropylmethyl-3-hexyloxy-10-methoxy-(1R,9R,10S)-17-azatetracyclo[7.5.3.01,10.02,7]heptadeca-2(7),3,5-trien-13-one | CHEMBL322738
Type:
Small organic molecule
Emp. Form.:
C27H39NO3
Mol. Mass.:
425.6035
SMILES:
CCCCCCOc1cccc2C[C@H]3N(CC4CC4)CCC4(CC(=O)CC[C@@]34OC)c12
: