Target
Peroxisome proliferator-activated receptor alpha
Ligand
BDBM50148108
Substrate
Meas. Tech.
ChEMBL_153394 (CHEMBL763847)
EC50
3000±n/a nM
Citation
 Koyama, HMiller, DJBoueres, JKDesai, RCJones, ABBerger, JPMacNaul, KLKelly, LJDoebber, TWWu, MSZhou, GWang, PRIppolito, MCChao, YSAgrawal, AKFranklin, RHeck, JVWright, SDMoller, DESahoo, SP (2R)-2-ethylchromane-2-carboxylic acids: discovery of novel PPARalpha/gamma dual agonists as antihyperglycemic and hypolipidemic agents. J Med Chem 47:3255-63 (2004)  
Target
Name:
Peroxisome proliferator-activated receptor alpha
Synonyms:
NR1C1 PPAR PPAR-alpha PPARA_HUMAN Peroxisome proliferator-activated receptor | Peroxisome proliferator-activated receptor alpha (PPAR alpha)
Type:
Enzyme
Mol. Mass.:
52222.08
Organism:
Homo sapiens (Human)
Description:
Q07869
Residue:
468
  
Inhibitor
Name:
BDBM50148108
Synonyms:
7-[3-(4-Phenoxy-2-propyl-phenoxy)-propoxy]-chroman-2-carboxylic acid | CHEMBL326273
Type:
Small organic molecule
Emp. Form.:
C28H30O6
Mol. Mass.:
462.5342
SMILES:
CCCc1cc(Oc2ccccc2)ccc1OCCCOc1ccc2CCC(Oc2c1)C(O)=O
: