Target
Peroxisome proliferator-activated receptor alpha
Ligand
BDBM50148096
Substrate
Meas. Tech.
ChEMBL_153394 (CHEMBL763847)
EC50
50±n/a nM
Citation
 Koyama, HMiller, DJBoueres, JKDesai, RCJones, ABBerger, JPMacNaul, KLKelly, LJDoebber, TWWu, MSZhou, GWang, PRIppolito, MCChao, YSAgrawal, AKFranklin, RHeck, JVWright, SDMoller, DESahoo, SP (2R)-2-ethylchromane-2-carboxylic acids: discovery of novel PPARalpha/gamma dual agonists as antihyperglycemic and hypolipidemic agents. J Med Chem 47:3255-63 (2004)  
Target
Name:
Peroxisome proliferator-activated receptor alpha
Synonyms:
NR1C1 PPAR PPAR-alpha PPARA_HUMAN Peroxisome proliferator-activated receptor | Peroxisome proliferator-activated receptor alpha (PPAR alpha)
Type:
Enzyme
Mol. Mass.:
52222.08
Organism:
Homo sapiens (Human)
Description:
Q07869
Residue:
468
  
Inhibitor
Name:
BDBM50148096
Synonyms:
2-Ethyl-7-[3-(2-fluoro-4-phenoxy-phenoxy)-propoxy]-chroman-2-carboxylic acid | CHEMBL112973
Type:
Small organic molecule
Emp. Form.:
C27H27FO6
Mol. Mass.:
466.4981
SMILES:
CCC1(CCc2ccc(OCCCOc3ccc(Oc4ccccc4)cc3F)cc2O1)C(O)=O
: